Questions tagged [runtime-error]

1

votes
0

answer
140

Views

How to solve this type of Unity Game error?

I am testing my unity game in Redmi 4 (Android version 7.1.2 N2G47H, MIUI version 9.1) & I am getting following error in crash report on redmi device. *** *** *** *** *** *** *** *** *** *** *** *** *** *** *** *** Build fingerprint: 'xiaomi/mido/mido:7.0/NRD90M/V9.0.5.0.NCFMIEI:user/release-keys' R...
Neel Gajjar
1

votes
0

answer
25

Views

iOS localized text not appearing on real device

I have localized my app. However, the storyboard text is failing in 1 instance. In Xcode, previewing the view controller for the required display language shows the correct text, and running on the simulator also works. However, when running on a real device (with the same display language set), th...
Agreensh
1

votes
1

answer
224

Views

Vba code getting error “select method of range class failed”

In the code below, I am getting an error 'Select Method of Range Class Failed' on the line indicated. I am trying to copy some fixed ranges from Worksheet A of Workbook XY into Worksheet A of all the open workbooks. Kindly help me with the issues. Also, suggest a better or optimized way of doing t...
yashika vaish
1

votes
1

answer
86

Views

gfortran 7, READ command and libraries

I have recently upgraded to gfortran 7.2 from 6.x using homebrew on OSx. I am now getting errors from the READ statement that I was not getting previously. A minimal example that generates the error is: PROGRAM read_test IMPLICIT NONE CHARACTER :: c INTEGER :: i c='1' READ(c,*) i WRITE(*,*) i END PR...
Mead
1

votes
1

answer
470

Views

“Run-time error ‘13’: Type mismatch” error message

Good afternoon. I’m new at VBA. From my research on the internet, I’ve been able to add some lines that display a message box when an NG is entered into a cell within the range. However, when I try to delete the inputs from several cells, I get a Run-time error ‘13’: Type mismatch message....
cmg
1

votes
0

answer
115

Views

System.Core v4.0.0.0 exception in Xamarin UWP project

Currently, I have a Xamarin forms project for Android and iOS application. And the application works perfectly in both Android and iOS. I wanted to provide the support in Windows as well. So I followed the below link to add the UWP project to my solution. https://developer.xamarin.com/guides/xamarin...
Vijay457
1

votes
2

answer
1.2k

Views

Run Time Error 5: Invalid Procedure Call or Argument

I am getting the Run Time Error 5: Invalid Procedure Call or Argument on this line: With ActiveSheet.QueryTables.Add(Connection:=User_File_Path, Destination:=Range('$A$1')) I have a message box right before that line that tells me the User_File_Path, which is populating, and when I hover over the C...
mitchmitch24
1

votes
1

answer
108

Views

Spring-Cloud-Config not getting properties

I cannot Create properties as I get this error: org.springframework.beans.factory.BeanCreationException: Error creating bean with name 'configClient': Injection of autowired dependencies failed; nested exception is java.lang.IllegalArgumentException: Could not resolve placeholder 'user.role' in valu...
Ed Diaz
1

votes
0

answer
188

Views

Xamarin + Visual Studio 2017 on Android: how debug Exception?

I have taken over a Xamarin.Forms (C#) application from an external source for fixing. Problem is, that the application does sometimes fail with a runtime error: System.NullReferenceException: Object reference not set to an instance of an object The message appears in the output console and in a sep...
Nimral
1

votes
0

answer
119

Views

Google Volley cause app to crash while running proguard

java.lang.NullPointerException at com.bash.farah.SiginActivity$2.onResponse(Unknown Source) at com.android.volley.toolbox.StringRequest.deliverResponse(Unknown Source) at com.android.volley.toolbox.StringRequest.deliverResponse(Unknown Source) at com.android.volley.ExecutorDelivery$ResponseDeliveryR...
Shaima Baasher
1

votes
1

answer
18

Views

Parameter value is not recognized, but correctly assigned according to Debugger

I am struggling with the following problems for hours and I am sure it is just a quick look for one of you experienced guys: I want to set the variable to the value of a cmb before its value is changed (so I can use the old value to search for the record I want to update), the Debugger shows that th...
VBA.starter
1

votes
1

answer
473

Views

MSVC++ Exception 0x80000003 In Different Language

I have some software that I've helped modify. We took the application from 32 to MFC to 64 bit MFC. It's been a pretty big project, but we are having this one really strange issue. My installer works on all of our computers here, the application works and doesn't have issues; however, when our cu...
thephysicsguy
1

votes
1

answer
219

Views

WinError 6 in moviepy execution

I understand this has been issued many times but I thought this has been solved altogether. Following is my code .. from moviepy.editor import * from random import randint import os import subprocess files = os.listdir('.') for sourceVideo in files: if (sourceVideo[-4:] == '.mp4') or (sourceVideo[-4...
Kesh
1

votes
0

answer
130

Views

Why cases showing runtime error verdict on Hackerrank in python 3

I am a beginner at python. That's why I am trying to solve some basic problems on Hackerrank.But in this problem String Formatting showing Runtime error on my code. I have tried many different ways to solve this problem but it always shows runtime error on my code. Here is my code: n=int(input()) fo...
milton.
1

votes
1

answer
233

Views

Error occurs - “Could not find or load main class ”, when run a topology on Storm official docker 1.2.1

I pulled the latest docker image from Docker Hub for Storm 1.2.1. And packaged the storm-starter example project from Storm source code 1.2.1 according to the README documentation under the project, and renamed the package as 'topology.jar'. But when I submitted the jar file into Storm docker with $...
LeoZhang
1

votes
0

answer
201

Views

java.lang.RuntimeException: Failed to read bitmap

I am trying to take a photo from the phone's camera, then pass it to tesseract engine and write the result on a text view by the code you can see in the following. MainActivity: package com.example.arbazalam.myapplication; import android.Manifest; import android.content.Intent; import android.conten...
user3486308
1

votes
0

answer
146

Views

Runtime Error in middle of large test suite : No more threads can be created

We have a very large automation suite that takes a good bit of time to run. These are UI tests for a windows app, and we use LeanFT & NUnit. S it is not web we do not yet have any sort of parallel/grid solution up and running. The whole suite has around 110 tests and all are ran on a single agent....
Tree55Topz
1

votes
1

answer
229

Views

VBA Outlook Run-time Error - Could not send the message

The VBA code shown below is for replying to an email with a specific template. The user selects the email that they want to reply to through a file dialog box, the code should then open a new email replying to the selected email. I am receiving the following error: Run-time error '-2147352567 (80020...
duberry
1

votes
1

answer
71

Views

Error handling not working for slide ID

having trouble dealing with an exception in my code. I have written the code below to transfer the contents of a powerpoint table into an array, but it keeps throwing an exception saying Slides (unknown member): Invalid request. Invalid Slide ID. I put in the error handle to try and skip this, as it...
Stuart
1

votes
0

answer
39

Views

TERMINATION Stack is not empty at destruction. Error Swift

I am using Google Mobile Vision to detect face landmarks and the distances between them. The weird thing about this error is that it is not consistent and does not show up all the time I run the same function. Here is the error message... TERMINATION ert_Error ebs_ObjectStack::~ebs_ObjectStack(): St...
coder
1

votes
0

answer
1.8k

Views

JavaFX Exception in Application start method (java.lang.IllegalStateException: Location is not set.)

I tried moving my fxml file around but I can't seem to get the right path to my file. Also does my controller have to be in the same package as my fmxl file. I read online I should put my fxml file into the resources folder and that's what I did but it's still not working. My controller is in the UI...
FruitCode
1

votes
0

answer
69

Views

VBA dynamic row lookup while looping

I'm very new to VBA and should probably spend some time on debugging and learning the formalities of how code should be written. I am using a loop that uses the Hlookup function to populate a table from on one sheet from data on a master sheet. (This is in the Sub SetMatrix). Within the Sub that pe...
aimceo2017
1

votes
0

answer
277

Views

Java runtime error: java.lang.ClassFormatError: StackMapTable format error: bad type array size

We are compiling and running in Java8. Full error is: java.lang.ClassFormatError: StackMapTable format error: bad type array size in method com.internal.connection.g.a(Ljava/lang/String;Ljava/util/Map;Z)Lcom/internal/connection/model/ExecuteAnonymousResponse; Java Version is: $ java -version java ve...
singularity
1

votes
0

answer
741

Views

Debug assertion failure, “__acrt_first_block == header” when using openCV for live webcam? [duplicate]

This question already has an answer here: why opencv imshow() create a new window has the same name as namedWindow() does in Debug Mode? 1 answer Debug Assertion Failed! Expression: __acrt_first_block == header 3 answers I'm trying to do finger recognition using opencv, which has been working corr...
rique98
1

votes
0

answer
75

Views

Does YARD have implicit dependencies?

In short, I have the following problem with my Ruby Gem project: rake doc runs locally without issue. (Ruby 2.3.1) rake doc errors out in the CI agent. (Ruby 2.5) bundle exec rake doc errors out locally with the same error. (Ruby 2.3.1) How can that be? Now for the details. The relevant part of my...
Raphael
1

votes
0

answer
164

Views

-encoding UTF-8 Java compile error

I am getting an error when I try to run my Java program, I never came across this before and when I searched online I could not find anything of help. /usr/lib/jvm/java-8-sun/bin/javac -encoding UTF-8 -classpath ':*:/usr/share/java/*' Solution.java 1> compile.err 2>&1 My Java project code: public c...
Jackie
1

votes
0

answer
38

Views

a middle approach between Dynamic Typing and Static Typing

I wanted to ask if anyone knows of a programming language where there is dynamic typing but the binding between a name and a type is permanent. Static typing guards your code from assigning a wrong value into a variable, but forces you to declare(and know) the type before compilation. Dynamic typing...
zombieParrot
1

votes
1

answer
188

Views

find kth missing element in a contiguous array (time limit exceeded)

Given an increasing sequence a[], we need to find the K-th missing contiguous element in the increasing sequence which is not present in the sequence. If no k-th missing element is there output -1. The first line consists of an integer T i.e. the number of test cases. The first line of each test cas...
ra_pri
1

votes
0

answer
100

Views

System.ObjectDisposedException when closing a form in vb.net

I am having a weird error and I am sure it is something very simple, but I can't for the life of me figure out what is going on. I thought I was opening and closing the forms properly, but it appears something is amiss. I am working with VS 2015. I have my program set to close when the last form is...
1

votes
2

answer
1.4k

Views

Python SQLAlchemy: psycopg2.ProgrammingError relation already exists?

I have repeatable tried to create a table MYTABLENAME with SQLAlchemy in Python. I deleted all tables through my SQL client Dbeaver but I am getting an error that the table exists such that Traceback (most recent call last): File '/home/hhh/anaconda3/lib/python3.6/site-packages/sqlalchemy/engine/bas...
hhh
1

votes
0

answer
661

Views

Script Component Transformation row value to variable

I have a script transformation component that takes input from an OLEDB source and, for each row, executes a stored procedure with parameters based on the row value. I have used this functionality in past solutions without issue however, it's now throwing the dreaded 'Object reference not set to an...
jbeckom
1

votes
0

answer
161

Views

R error when modifying model variables: “model frame and formula mismatch in model.matrix()”

I wanted to write a function which takes a model, calculates the vif, and returns a new model with the collinear variables removed. Here's my code: remodel_vif % {which(. > vif_cutoff)} new_df % dplyr::select(.,-bad_x) return(lm(new_df)) } If I execute the function, it throws an error: data % as.ma...
Spine Feast
1

votes
1

answer
44

Views

vba runtime error 1004 application defined or object defined error

Something very strange happened. At one point this was working and all of a sudden now I get an error. The issue is fm and sm, when the debug is on, fm = Empty and sm = Empty Therefore tval = Empty the error occurs at line 34: tval = WorksheetFunction.Sum(ws.Range(ws.Cells(fm, 11), ws.Cells(sm, 11)...
Death Magnetic
1

votes
3

answer
2.2k

Views

Excel VBA Macro with run-time error '1004'

can anyone help me with this? for this particular function, it is getting run-time error 1004 for 'sheet1.Range('a1:a' & RowNbr).AdvancedFilter Action:=xlFilterCopy, CopyToRange:=sheet1.Range('J1'), Unique:=True' this is the full codes: Sub stock_exercise() Dim RowNbr As Long Dim uniqueticker As Lon...
Andres Silvia
1

votes
0

answer
148

Views

An exception occurred while trying to update the data smart tasks, they will be disabled. Requested value 'Properties' was not found

When I open any window in project in Visual Studio, I get this error message. I did not find any results. What is the reason? An exception occurred while trying to update the data smart tasks, they will be disabled. Requested value 'Properties' was not found. Image
Cihangir Sur
1

votes
1

answer
419

Views

Lightweight Rendering Pipeline error

I downloaded the lightweight rendering pipeline using Unity's package manager, but I cannot create a lightweight pipeline asset. When I try to create the asset, the console throws me: Invalid generated unique path 'ProjectSettings/LightweightAsset.asset' (input path 'LightweightAsset.asset')UnityEng...
1

votes
1

answer
22

Views

While truncating a text file in python , I am getting “File not open for truncating” even though I open that file. Details down there

from sys import argv script , filename = argv print(f'\n\nThis program is meant to truncate {filename}') print('Opening The file ...') target = open(filename) print('\n\n Truncating the file ...') target.truncate() print(f'Now, I will ask you for 1 line to put into {filename}') line1 = input('line 1...
Sameer Anand
1

votes
0

answer
61

Views

How to prevent maximum recursion runtime error in python when using the libtiff library

In the past few years I have worked with the libtiff library and I have developed some classes and scripts around it. I felt confident to now use my insights in a larger project. Instead of opening one TIFF file, I had to now open many of them. The runtime error 'maximum recursion depth exceeded' ha...
Dobedani
1

votes
1

answer
41

Views

Need help pinpointing cause of nil reference error in middleware test (Golang)

I've run up against an 'invalid memory address or nil pointer dereference' error while writing unit tests for my http handlers--specifically, authentication middleware. Here is the function to be tested: func Authenticate(next http.Handler) http.Handler { return http.HandlerFunc(func(w http.Response...
prhineh1
1

votes
1

answer
37

Views

outlook vba calling an Excel dialog.show fails

I have an Outlook macro that's failing with a run-time error 1004 'show method of dialog class failed' on line: xlApp.Dialogs(xlDialogColorPalette).Show The relevant parts of code (or so I think) are: Private WithEvents oExpl As Explorer Private WithEvents oItem As MailItem Private WithEvents respIt...
stevica

View additional questions